{"text_format":"1","workbook":"xlsx","n_sheets":8,"sheets":["Ana Sayfa","Gezi Bilgileri","Öğrenci Listesi","Yazı","Gezi Planı Ön","Gezi Planı Arka","Veli İzin Belgesi","Sözleşme"],"not_rendered":{"charts":0,"images":6,"macros":1,"external_links":0,"defined_names":0,"comments":0,"pivot_tables":0},"unopened":[],"bounds":{"document_bytes":16777216,"sheet_cells":100000,"rows_first":2000,"rows_last":500,"rows_between":2000,"halvings":0,"cell_chars":16384,"cell_head_chars":4096},"cells_cut":0,"cells_raw":0,"read":"whole","date_system":"1900"}

{"sheet":"Ana Sayfa","index":0,"n_rows":0,"n_cols":0,"rows_kept":0,"cut":false,"hidden":false,"merged":[]}

{"sheet":"Gezi Bilgileri","index":1,"n_rows":42,"n_cols":18,"rows_kept":42,"cut":false,"hidden":false,"merged":[[10,1,10,16],[30,0,30,4],[29,5,29,16],[30,5,30,16],[31,0,31,4],[31,5,31,16],[28,0,28,4],[15,0,18,0],[25,0,26,0],[16,1,16,16],[11,1,11,16],[12,1,12,16],[13,1,13,16],[14,1,14,16],[15,1,15,16],[19,1,19,16],[0,1,0,16],[4,1,4,16],[5,1,5,16],[6,1,6,16],[9,1,9,16],[7,1,7,16],[8,1,8,16],[1,1,1,16],[3,1,3,16],[2,1,2,16],[32,0,32,4],[33,0,33,4],[27,0,27,4],[23,1,23,16],[28,5,28,16],[32,5,32,16],[33,5,33,16],[26,1,26,5],[26,6,26,10],[26,11,26,16],[24,1,24,16],[25,1,25,5],[25,6,25,10],[25,11,25,16],[29,0,29,4],[21,0,24,0],[17,1,17,16],[18,1,18,16],[20,1,20,16],[21,1,21,16],[22,1,22,16],[34,0,34,4],[35,0,35,4],[36,0,36,4],[40,0,40,4],[41,0,41,4],[37,0,37,4],[38,0,38,4],[39,0,39,4],[34,5,34,16],[35,5,35,16],[36,5,36,16],[40,5,40,16],[41,5,41,16],[37,5,37,16],[38,5,38,16],[39,5,39,16]]}
["Kurumun Adı","Osmancık İlkokulu"]
["Kudumun Adresi","Koyunbaba Mahallesi Vatan Caddesi No:74 Osmancık/ÇORUM"]
["Kurum Telefonu","0364 611 22 28"]
["Kurum e-posta","767626@meb.k12.tr"]
["Okul Müdürü","Pelin MORKOÇ"]
["Gezi Düzenleyen Sınıf"]
["Görevli Öğretmen"]
["Görevi","Sınıf Öğretmeni"]
["Üst Yazı Tarihi",null,null,null,null,null,null,null,null,null,null,null,null,null,null,null,null,{"$f":"TEXT(B9,\"gg.aa.yyyy gggg\")","v":"00.01.1900 Cumartesi"}]
["Gezi Başlangıç Tarihi",null,null,null,null,null,null,null,null,null,null,null,null,null,null,null,null,{"$f":"TEXT(B10,\"gg.aa.yyyy gggg\")","v":"00.01.1900 Cumartesi"}]
["Gezi Bitiş Tarihi",null,null,null,null,null,null,null,null,null,null,null,null,null,null,null,null,{"$f":"TEXT(B11,\"gg.aa.yyyy gggg\")","v":"00.01.1900 Cumartesi"}]
["Gezi Yeri"]
["Gesi Başlangıç Saati",null,null,null,null,null,null,null,null,null,null,null,null,null,null,null,null,{"$f":"TEXT(B13,\"ss:dd\")","v":"00:00"}]
["Gesi Bitiş Saati",null,null,null,null,null,null,null,null,null,null,null,null,null,null,null,null,{"$f":"TEXT(B14,\"ss:dd\")","v":"00:00"}]
["Takip Edilecek Yol"]
["Gezinin Amacı"]
[]
[]
[]
["Gezinin Konusu"]
["Gezi İçin Öğrencilere Verilecek İnceleme- Araştırma Görevi"]
["Değerlendirme"]
[]
[]
[]
["Geziye Katılan Öğrenci Sayısı","Kız",null,null,null,null,"Erkek",null,null,null,null,"Toplam"]
[null,{"$f":"IF('Öğrenci Listesi'!E46=\"\",\"\",'Öğrenci Listesi'!E46)","v":0},null,null,null,null,{"$f":"IF('Öğrenci Listesi'!E47=\"\",\"\",'Öğrenci Listesi'!E47)","v":0},null,null,null,null,{"$f":"IF('Öğrenci Listesi'!E48=\"\",\"\",'Öğrenci Listesi'!E48)","v":0}]
["GEZİYE KATILACAK ARAÇLAR"]
["Yüklenici Firma/ Acente Adı"]
["Yüklenici Firma/ Acente Adresi"]
["Yüklenici Firma/ Acente Telefonu"]
["Yüklenici Firma/ Acente e-posta Adresi"]
["İşletme Belgesi No:"]
["TÜRSAB Belge No: "]
["B2/D2 Yetki Belgesi No: "]
["Mesleki Yeterlik Belgesi (SRC1/SRC2) No:"]
["Şoförün Adı ve Soyadı"]
["Şoförün Adresi"]
["Şoförün Telefonu"]
["Şoförün e-posta Adresi"]
{"$rows_left_out":3}
{"sheet":"Öğrenci Listesi","index":2,"n_rows":48,"n_cols":7,"rows_kept":48,"cut":false,"hidden":false,"merged":[[0,0,0,6]]}
["OSMANCIK İLKOKULU\n3-A SINIFI ÖĞRECİ LİSTESİ"]
["SIRA"," NO","ADI","SINIF","CINSIYET","VELI","VELİ İLETİŞİM"]
[1]
[2]
[3]
[4]
[5]
[6]
[7]
[8]
[9]
[10]
[11]
[12]
[13]
[14]
[15]
[16]
[17]
[18]
[19]
[20]
[21]
[22]
[23]
[24]
[25]
[26]
[27]
[28]
[29]
[30]
[31]
[32]
[33]
[34]
[35]
[36]
[37]
[38]
{"$rows_left_out":9}
{"sheet":"Yazı","index":3,"n_rows":25,"n_cols":18,"rows_kept":25,"cut":false,"hidden":false,"merged":[[0,0,0,28],[2,0,2,28],[1,0,1,28],[7,17,7,27],[8,17,8,27],[9,17,9,27],[20,9,20,19],[21,9,21,19],[23,9,23,19],[24,9,24,19]]}
[{"$f":"UPPER(CONCATENATE('Gezi Bilgileri'!B1,\" MÜDÜRLÜĞÜNE\"))","v":"OSMANCIK İLKOKULU MÜDÜRLÜĞÜNE"}]
[]
[{"$f":"CONCATENATE(\"        Okulumuzun \",'Gezi Bilgileri'!B6,\" sınıfı olarak \",'Gezi Bilgileri'!R10,\" günü saat \",'Gezi Bilgileri'!R13,\"-\",'Gezi Bilgileri'!R14,\" saatleri arasında güzergahı gezi planı üzerinde belirtilen gezi planlamaktayız.\",\" Düzenlenecek gezi için gerekli olan öğrenci listesi, Veli izin belgeleri ve gezi planı ekte sunulmuştur. Gereğinin yapılmasını arz ederim.\")","v":"        Okulumuzun  sınıfı olarak 00.01.1900 Cumartesi günü saat 00:00-00:00 saatleri arasında güzergahı gezi planı üzerinde belirtilen gezi planlamaktayız. Düzenlenecek gezi için gerekli olan öğrenci listesi, Veli izin belgeleri ve gezi planı ekte sunulmuştur. Gereğinin yapılmasını arz ederim."}]
[]
[]
[]
[]
[null,null,null,null,null,null,null,null,null,null,null,null,null,null,null,null,null,{"$f":"IF('Gezi Bilgileri'!B9=\"\",\"\",'Gezi Bilgileri'!B9)","v":""}]
[null,null,null,null,null,null,null,null,null,null,null,null,null,null,null,null,null,{"$f":"IF('Gezi Bilgileri'!B7=\"\",\"\",'Gezi Bilgileri'!B7)","v":""}]
[null,null,null,null,null,null,null,null,null,null,null,null,null,null,null,null,null,{"$f":"IF('Gezi Bilgileri'!B8=\"\",\"\",'Gezi Bilgileri'!B8)","v":"Sınıf Öğretmeni"}]
[]
[]
[]
[]
[]
[]
[]
[]
[]
[]
[null,null,null,null,null,null,null,null,null,"U Y G U N D U R"]
[null,null,null,null,null,null,null,null,null,{"$f":"IF('Gezi Bilgileri'!B9=\"\",\"\",'Gezi Bilgileri'!B9)","v":""}]
[]
[null,null,null,null,null,null,null,null,null,{"$f":"IF('Gezi Bilgileri'!B5=\"\",\"\",'Gezi Bilgileri'!B5)","v":"Pelin MORKOÇ"}]
[null,null,null,null,null,null,null,null,null,"Okul Müdürü"]

{"sheet":"Gezi Planı Ön","index":4,"n_rows":25,"n_cols":25,"rows_kept":25,"cut":false,"hidden":false,"merged":[[0,0,0,30],[8,0,11,8],[9,9,9,30],[10,9,10,30],[11,9,11,30],[1,9,1,30],[2,9,2,30],[3,9,3,30],[4,9,4,30],[5,9,5,30],[6,9,6,30],[7,9,7,30],[8,9,8,30],[1,0,1,8],[2,0,2,8],[3,0,3,8],[4,0,4,8],[5,0,5,8],[6,0,6,8],[7,0,7,8],[12,0,12,8],[12,9,12,30],[14,0,17,8],[15,9,15,30],[16,9,16,30],[17,9,17,30],[13,9,13,30],[14,9,14,30],[13,0,13,8],[19,0,19,30],[20,0,20,5],[20,6,20,11],[20,12,20,17],[20,18,20,23],[20,24,20,30],[22,0,22,5],[22,6,22,11],[22,12,22,17],[22,18,22,23],[22,24,22,30],[21,0,21,5],[21,6,21,11],[21,12,21,17],[21,18,21,23],[21,24,21,30],[24,0,24,5],[24,6,24,11],[24,12,24,17],[24,18,24,23],[24,24,24,30],[23,0,23,5],[23,6,23,11],[23,12,23,17],[23,18,23,23],[23,24,23,30]]}
["GEZİ PLANI"]
["Eğitim Kurumunun Adı",null,null,null,null,null,null,null,null,{"$f":"IF('Gezi Bilgileri'!B1=\"\",\"\",'Gezi Bilgileri'!B1)","v":"Osmancık İlkokulu"}]
["Gezi Tarihi",null,null,null,null,null,null,null,null,{"$f":"IF('Gezi Bilgileri'!B10=\"\",\"\",'Gezi Bilgileri'!B10)","v":""}]
["Gezi Yeri",null,null,null,null,null,null,null,null,{"$f":"IF('Gezi Bilgileri'!B12=\"\",\"\",'Gezi Bilgileri'!B12)","v":""}]
["Geziye Çıkış Saati",null,null,null,null,null,null,null,null,{"$f":"IF('Gezi Bilgileri'!B13=\"\",\"\",'Gezi Bilgileri'!B13)","v":""}]
["Geziden Dönüş Saati",null,null,null,null,null,null,null,null,{"$f":"IF('Gezi Bilgileri'!B14=\"\",\"\",'Gezi Bilgileri'!B14)","v":""}]
["Gezi Kafile Başkanı",null,null,null,null,null,null,null,null,{"$f":"IF('Gezi Bilgileri'!B7=\"\",\"\",'Gezi Bilgileri'!B7)","v":""}]
["Takip Edilecek Yol",null,null,null,null,null,null,null,null,{"$f":"IF('Gezi Bilgileri'!B15=\"\",\"\",'Gezi Bilgileri'!B15)","v":""}]
["Gezinin Amacı",null,null,null,null,null,null,null,null,{"$f":"IF('Gezi Bilgileri'!B16=\"\",\"\",CONCATENATE(\"1-\",'Gezi Bilgileri'!B16))","v":""}]
[null,null,null,null,null,null,null,null,null,{"$f":"IF('Gezi Bilgileri'!B17=\"\",\"\",CONCATENATE(\"2-\",'Gezi Bilgileri'!B17))","v":""}]
[null,null,null,null,null,null,null,null,null,{"$f":"IF('Gezi Bilgileri'!B18=\"\",\"\",CONCATENATE(\"3-\",'Gezi Bilgileri'!B18))","v":""}]
[null,null,null,null,null,null,null,null,null,{"$f":"IF('Gezi Bilgileri'!B19=\"\",\"\",CONCATENATE(\"4-\",'Gezi Bilgileri'!B19))","v":""}]
["Gezinin Konusu",null,null,null,null,null,null,null,null,{"$f":"IF('Gezi Bilgileri'!B20=\"\",\"\",'Gezi Bilgileri'!B20)","v":""}]
["Gezi İçin Öğrencilere Verilecek İnceleme Araştırma Görevi",null,null,null,null,null,null,null,null,{"$f":"IF('Gezi Bilgileri'!B21=\"\",\"\",'Gezi Bilgileri'!B21)","v":""}]
["Değerlendirme",null,null,null,null,null,null,null,null,{"$f":"IF('Gezi Bilgileri'!B22=\"\",\"\",CONCATENATE(\"1-\",'Gezi Bilgileri'!B22))","v":""}]
[null,null,null,null,null,null,null,null,null,{"$f":"IF('Gezi Bilgileri'!B23=\"\",\"\",CONCATENATE(\"2-\",'Gezi Bilgileri'!B23))","v":""}]
[null,null,null,null,null,null,null,null,null,{"$f":"IF('Gezi Bilgileri'!B24=\"\",\"\",CONCATENATE(\"3-\",'Gezi Bilgileri'!B24))","v":""}]
[null,null,null,null,null,null,null,null,null,{"$f":"IF('Gezi Bilgileri'!B25=\"\",\"\",CONCATENATE(\"4-\",'Gezi Bilgileri'!B25))","v":""}]
[]
["GEZİYE KATILACAK SINIFLAR VE ÖĞRENCİ SAYILARI"]
["Sıra No",null,null,null,null,null,"Şube",null,null,null,null,null,"Kız",null,null,null,null,null,"Erkek",null,null,null,null,null,"Toplam"]
[1,null,null,null,null,null,{"$f":"IF('Gezi Bilgileri'!B6=\"\",\"\",'Gezi Bilgileri'!B6)","v":""},null,null,null,null,null,{"$f":"IF('Gezi Bilgileri'!B27=\"\",\"\",'Gezi Bilgileri'!B27)","v":0},null,null,null,null,null,{"$f":"IF('Gezi Bilgileri'!G27=\"\",\"\",'Gezi Bilgileri'!G27)","v":0},null,null,null,null,null,{"$f":"IF('Gezi Bilgileri'!L27=\"\",\"\",'Gezi Bilgileri'!L27)","v":0}]
[{"$f":"IF(A22=\"\",\"\",A22+1)","v":2}]
[{"$f":"IF(A23=\"\",\"\",A23+1)","v":3}]
["Toplam"]

{"sheet":"Gezi Planı Arka","index":5,"n_rows":32,"n_cols":23,"rows_kept":32,"cut":false,"hidden":false,"merged":[[1,0,1,26],[2,0,2,3],[2,4,2,20],[2,21,2,26],[3,0,3,3],[3,4,3,20],[3,21,3,26],[4,0,4,3],[4,4,4,20],[4,21,4,26],[5,0,5,3],[5,4,5,20],[5,21,5,26],[6,0,6,3],[6,4,6,20],[6,21,6,26],[7,0,7,3],[7,4,7,20],[7,21,7,26],[11,15,11,21],[12,15,12,21],[8,0,8,3],[8,4,8,20],[8,21,8,26],[9,0,9,26],[10,0,10,26],[11,0,11,14],[11,22,11,26],[12,22,12,26],[13,15,13,26],[14,15,14,26],[15,15,15,26],[16,0,16,14],[16,15,16,21],[16,22,16,26],[12,0,13,14],[14,0,14,5],[15,0,15,5],[14,6,14,14],[15,6,15,14],[17,0,17,1],[18,0,18,1],[19,0,19,1],[20,0,20,1],[17,2,17,14],[18,2,18,14],[19,2,19,14],[20,2,20,14],[17,15,17,21],[17,22,17,26],[18,15,18,21],[18,22,18,26],[19,15,19,21],[19,22,19,26],[20,22,20,26],[20,15,20,21],[22,15,22,25],[23,15,23,25],[27,7,27,17],[28,7,28,17],[30,7,30,17],[31,7,31,17],[32,7,32,17],[33,7,33,17]]}
[]
["GEZİYE KATILACAK SORUMLU VE REHBER ÖĞRETMENLER"]
["Sıra No",null,null,null,"Adı Soyadı",null,null,null,null,null,null,null,null,null,null,null,null,null,null,null,null,"İmzası"]
[1,null,null,null,{"$f":"CONCATENATE('Gezi Bilgileri'!B7,\" - \",'Gezi Bilgileri'!B8)","v":" - Sınıf Öğretmeni"}]
[2]
[3]
[4]
[5]
[6]
[]
["GEZİYE KATILACAK ARAÇLAR"]
["Yüklenici Firma/ Acente Adı:"]
[{"$f":"IF('Gezi Bilgileri'!F29=\"\",\"\",'Gezi Bilgileri'!F29)","v":""},null,null,null,null,null,null,null,null,null,null,null,null,null,null,"B2/D2 Yetki Belgesi No: ",null,null,null,null,null,null,{"$f":"IF('Gezi Bilgileri'!F35=\"\",\"\",'Gezi Bilgileri'!F35)","v":""}]
[null,null,null,null,null,null,null,null,null,null,null,null,null,null,null,"Mesleki Yeterlik Belgesi (SRC1/SRC2) No:"]
["İşletme Belgesi No: ",null,null,null,null,null,{"$f":"IF('Gezi Bilgileri'!F33=\"\",\"\",'Gezi Bilgileri'!F33)","v":""},null,null,null,null,null,null,null,null,{"$f":"IF('Gezi Bilgileri'!F36=\"\",\"\",'Gezi Bilgileri'!F36)","v":""}]
["TÜRSAB Belge No:",null,null,null,null,null,{"$f":"IF('Gezi Bilgileri'!F34=\"\",\"\",'Gezi Bilgileri'!F34)","v":""}]
["Şoförün Adı ve Soyadı",null,null,null,null,null,null,null,null,null,null,null,null,null,null,"Araç Plakası",null,null,null,null,null,null,"Model Yılı"]
[1,null,{"$f":"IF('Gezi Bilgileri'!F37=\"\",\"\",'Gezi Bilgileri'!F37)","v":""},null,null,null,null,null,null,null,null,null,null,null,null,{"$f":"IF('Gezi Bilgileri'!F41=\"\",\"\",'Gezi Bilgileri'!F41)","v":""},null,null,null,null,null,null,{"$f":"IF('Gezi Bilgileri'!F42=\"\",\"\",'Gezi Bilgileri'!F42)","v":""}]
[2]
[3]
[4]
[]
[null,null,null,null,null,null,null,null,null,null,null,null,null,null,null,{"$f":"IF('Gezi Bilgileri'!B7=\"\",\"\",'Gezi Bilgileri'!B7)","v":""}]
[null,null,null,null,null,null,null,null,null,null,null,null,null,null,null,{"$f":"IF('Gezi Bilgileri'!B8=\"\",\"\",'Gezi Bilgileri'!B8)","v":"Sınıf Öğretmeni"}]
[]
[]
[]
[null,null,null,null,null,null,null,"U Y G U N D U R"]
[null,null,null,null,null,null,null,{"$f":"IF('Gezi Bilgileri'!B9=\"\",\"\",'Gezi Bilgileri'!B9)","v":""}]
[]
[null,null,null,null,null,null,null,{"$f":"IF('Gezi Bilgileri'!B5=\"\",\"\",'Gezi Bilgileri'!B5)","v":"Pelin MORKOÇ"}]
[null,null,null,null,null,null,null,"Okul Müdürü"]

{"sheet":"Veli İzin Belgesi","index":6,"n_rows":52,"n_cols":15,"rows_kept":52,"cut":false,"hidden":false,"merged":[[49,7,49,10],[50,7,50,10],[51,7,51,10],[6,1,6,2],[7,1,7,2],[10,1,10,2],[8,1,8,2],[35,1,35,2],[36,1,36,2],[37,1,37,2],[35,4,35,10],[36,4,36,10],[37,4,37,10],[6,4,6,10],[7,4,7,10],[8,4,8,10],[3,1,4,10],[21,7,21,10],[22,7,22,10],[20,7,20,10],[5,1,5,10],[32,1,33,10],[34,1,34,10],[40,1,47,10],[38,1,38,2],[9,1,9,2],[9,4,9,10],[38,4,38,10],[11,1,18,10]]}
[null,null,null,null,null,null,null,null,null,null,null,null,null,1,{"$f":"COUNTA('Öğrenci Listesi'!C3:C186)","v":3}]
[]
[]
[null,"VELİ İZİN BELGESİ"]
[]
[]
[null,"        Adı-Soyadı",null,":",{"$f":"IF(INDEX('Öğrenci Listesi'!C3:C186,'Veli İzin Belgesi'!N1)=\"\",\"\",INDEX('Öğrenci Listesi'!C3:C186,'Veli İzin Belgesi'!N1))","v":""}]
[null,"        Okulu",null,":",{"$f":"IF('Gezi Bilgileri'!B1=\"\",\"\",'Gezi Bilgileri'!B1)","v":"Osmancık İlkokulu"}]
[null,"        Sınıfı",null,":",{"$f":"IF(INDEX('Öğrenci Listesi'!D3:D186,'Veli İzin Belgesi'!N1)=\"\",\"\",INDEX('Öğrenci Listesi'!D3:D186,'Veli İzin Belgesi'!N1))","v":""}]
[null,"        No",null,null,{"$f":"IF(INDEX('Öğrenci Listesi'!B3:B186,'Veli İzin Belgesi'!N1)=\"\",\"\",INDEX('Öğrenci Listesi'!B3:B186,'Veli İzin Belgesi'!N1))","v":""}]
[]
[null,{"$f":"CONCATENATE(\"        Yukarıda bilgileri yazılı öğrencinin velisiyim. \",'Gezi Bilgileri'!R10,\" günü \",'Gezi Bilgileri'!R13,\" - \",'Gezi Bilgileri'!R14,\" saatleri arasında \",'Gezi Bilgileri'!B20,\" amacıyla düzenlenecek sınıf gezisine katılmasına izin veriyorum. Gereğinin yapılmasını arz ederim\")","v":"        Yukarıda bilgileri yazılı öğrencinin velisiyim. 00.01.1900 Cumartesi günü 00:00 - 00:00 saatleri arasında  amacıyla düzenlenecek sınıf gezisine katılmasına izin veriyorum. Gereğinin yapılmasını arz ederim"}]
[]
[]
[]
[]
[]
[]
[]
[]
[null,null,null,null,null,null,null,{"$f":"TODAY()","v":"2023-11-24"}]
[null,null,null,null,null,null,null,{"$f":"IF(INDEX('Öğrenci Listesi'!F3:F186,'Veli İzin Belgesi'!N1)=\"\",\"\",INDEX('Öğrenci Listesi'!F3:F35,'Veli İzin Belgesi'!N1))","v":""}]
[null,null,null,null,null,null,null,"Öğrenci Velisi"]
[]
[]
[]
[]
[]
[]
[]
[]
[]
[null,{"$f":"B4","v":"VELİ İZİN BELGESİ"}]
[]
[]
[null,"        Adı-Soyadı",null,":",{"$f":"IF(INDEX('Öğrenci Listesi'!C3:C186,'Veli İzin Belgesi'!N1+1)=\"\",\"\",INDEX('Öğrenci Listesi'!C3:C186,'Veli İzin Belgesi'!N1+1))","v":""}]
[null,"        Okulu",null,":",{"$f":"E8","v":"Osmancık İlkokulu"}]
[null,"        Sınıfı",null,":",{"$f":"IF(INDEX('Öğrenci Listesi'!D3:D186,'Veli İzin Belgesi'!N1+1)=\"\",\"\",INDEX('Öğrenci Listesi'!D3:D186,'Veli İzin Belgesi'!N1+1))","v":""}]
[null,"        No",null,null,{"$f":"IF(INDEX('Öğrenci Listesi'!B3:B186,'Veli İzin Belgesi'!N1+1)=\"\",\"\",INDEX('Öğrenci Listesi'!B3:B186,'Veli İzin Belgesi'!N1+1))","v":""}]
[]
{"$rows_left_out":13}
{"sheet":"Sözleşme","index":7,"n_rows":66,"n_cols":15,"rows_kept":66,"cut":false,"hidden":false,"merged":[[63,13,64,23],[65,1,65,7],[65,14,65,22],[60,1,60,7],[61,1,61,7],[62,1,62,7],[63,1,63,7],[64,1,64,7],[6,0,6,24],[0,0,0,24],[1,0,1,24],[3,0,3,24],[4,0,4,24],[5,0,5,24],[2,0,2,24],[33,0,33,24],[18,0,18,24],[7,0,7,24],[8,0,8,24],[9,0,9,24],[10,0,10,24],[11,0,11,24],[12,0,12,24],[13,0,13,24],[14,0,14,24],[15,0,15,24],[16,0,16,24],[17,0,17,24],[41,0,41,24],[36,0,36,24],[30,0,30,24],[19,0,19,24],[20,0,20,24],[21,0,21,24],[22,0,22,24],[23,0,23,24],[24,0,24,24],[25,0,25,24],[26,0,26,24],[27,0,27,24],[28,0,28,24],[29,0,29,24],[31,0,31,24],[32,0,32,24],[42,0,42,24],[34,0,34,24],[35,0,35,24],[51,0,51,24],[49,0,49,24],[50,0,50,24],[43,0,43,24],[44,0,44,24],[45,0,45,24],[46,0,46,24],[47,0,47,24],[48,0,48,24],[37,0,37,24],[38,0,38,24],[39,0,39,24],[40,0,40,24]]}
["EK-6"]
["EĞİTİM KURUMU GEZİLERİ ÇERÇEVE SÖZLEŞMESİ"]
["Sözleşmenin tarafları"]
[{"$f":"CONCATENATE(\"MADDE 1- Bu sözleşme, \",UPPER('Gezi Bilgileri'!B1),\" ile yüklenici acente/firma \",IF(UPPER('Gezi Bilgileri'!F29)=\"\",UPPER('Gezi Bilgileri'!F37),UPPER('Gezi Bilgileri'!F29)),\" arasında aşağıda yazılı şartlar dâhilinde yapılmıştır.\")","v":"MADDE 1- Bu sözleşme, OSMANCIK İLKOKULU ile yüklenici acente/firma  arasında aşağıda yazılı şartlar dâhilinde yapılmıştır."}]
["Taraflara ilişkin bilgiler"]
[{"$f":"CONCATENATE(\"MADDE 2- 2.1. Eğitim kurumunun adresi : \",UPPER('Gezi Bilgileri'!B2),\" olup,Tel ve Belgegeçer No: \",UPPER('Gezi Bilgileri'!B3),\" dir.\")","v":"MADDE 2- 2.1. Eğitim kurumunun adresi : KOYUNBABA MAHALLESİ VATAN CADDESİ NO:74 OSMANCIK/ÇORUM olup,Tel ve Belgegeçer No: 0364 611 22 28 dir."}]
[{"$f":"CONCATENATE(\"Elektronik Posta Adresi : \",IF(UPPER('Gezi Bilgileri'!B4)=\"\",\"................................................\",UPPER('Gezi Bilgileri'!B4)),\" 'dir\")","v":"Elektronik Posta Adresi : 767626@MEB.K12.TR 'dir"}]
[{"$f":"CONCATENATE(\"2.2. Yüklenici acente/firmanın tebligat adresi : \",IF('Gezi Bilgileri'!F30=\"\",'Gezi Bilgileri'!F38,'Gezi Bilgileri'!F30),\"  olup, Tel ve Belgegeçer No: \",IF('Gezi Bilgileri'!F31=\"\",'Gezi Bilgileri'!F39,'Gezi Bilgileri'!F31),\" 'dir\")","v":"2.2. Yüklenici acente/firmanın tebligat adresi :   olup, Tel ve Belgegeçer No:  'dir"}]
[{"$f":"CONCATENATE(\"Elektronik Posta Adresi : \",IF('Gezi Bilgileri'!F32=\"\",'Gezi Bilgileri'!F40,'Gezi Bilgileri'!F32),\" 'dir.\")","v":"Elektronik Posta Adresi :  'dir."}]
["2.3 Madde 2.1 ve 2.2’de belirtilen adreslerin değişiklikleri usulüne uygun şekilde karşı tarafa tebliğ edilmedikçe en son bildirilen adrese yapılacak tebliğ ilgili tarafa yapılmış sayılır."]
["İşin tanımı"]
[{"$f":"CONCATENATE(\"MADDE 3-3.1. Sözleşme konusu iş; \",UPPER('Gezi Bilgileri'!B1),\" öğretmen, öğrenci ve velilerinden oluşan gezi grubunun \",UPPER('Gezi Bilgileri'!B12),\" 'a düzenleyecekleri geziye ilişkin sözleşmenin konusunu oluşturmaktadır.\")","v":"MADDE 3-3.1. Sözleşme konusu iş; OSMANCIK İLKOKULU öğretmen, öğrenci ve velilerinden oluşan gezi grubunun  'a düzenleyecekleri geziye ilişkin sözleşmenin konusunu oluşturmaktadır."}]
[{"$f":"CONCATENATE(\"3.2.Gezinin süresi: Gezi, \",'Gezi Bilgileri'!R10,\" saat: \",'Gezi Bilgileri'!R13,\" ’da hareket, \",'Gezi Bilgileri'!R11,\" saat : \",'Gezi Bilgileri'!R14,\" ’da dönüş olmak üzere toplam ……. gece ………gündüzdür.\")","v":"3.2.Gezinin süresi: Gezi, 00.01.1900 Cumartesi saat: 00:00 ’da hareket, 00.01.1900 Cumartesi saat : 00:00 ’da dönüş olmak üzere toplam ……. gece ………gündüzdür."}]
["3.3.Yol güzergâhı ve gezilecek yerler: Gezi Planında (EK- 9) açıklandığı biçimdedir."]
["Ulaşım biçimi"]
["MADDE 4- Geziler, sigorta ve yolcu güvenliği sağlanmış karayolu, demiryolu, hava ve deniz\nulaşım araçları ile düzenlenebilir."]
["Gezi ücreti ve ödeme şekli"]
["MADDE 5-5.1. Gezi ücreti, sigorta ve vergiler dahil toplam …….. TL’dir. Bu iş için sözleşme bedelinin % ….’u oranında ön ödeme sözleşmenin imzalanmasını müteakip …………….. iş günü içerisinde; kalan ücret ise işin bitimini müteakiben …………….iş günü içerisinde yükleniciye ödenecektir."]
["5.2.Yüklenici, sözleşmenin tamamen ifasına kadar, vergi, resim, harç ve benzeri mali yükümlülüklerde artışa gidilmesi veya yeni mali yükümlülüklerin ihdası gibi nedenlerle fiyat farkı verilmesi talebinde bulunamaz."]
["5.3. Sözleşmenin hiç gerçekleşmemesi hâlinde, sözleşme okul idaresince tek taraflı feshedilir ya da gereği gibi ifa edilmemesi okul kusuruna veya mücbir bir sebebe dayanıyorsa gezi planı doğrultusunda gerçekleşen hizmet oranında karşılıklı iyi niyet çerçevesinde uzlaşılarak ödeme yapılır."]
["Vergi, resim ve harçlar"]
["MADDE 6-  Sözleşme kapsamındaki işlerle ilgili her türlü vergi, resim ve harçlar yükleniciye aittir."]
["Sorumluluklar"]
["MADDE 7- 7.1. Yüklenici sözleşmeden doğan yükümlülüklerin yerine getirilmesinden sorumludur."]
["7.2. Gezi sırasında, yüklenicinin sözleşmenin esaslı unsurunu oluşturan hizmetlerden bir veya birkaçını sağlamaması ya da sağlamayacağının anlaşılması durumunda, yüklenici, gezinin devam etmesi için okula ilave maliyet getirmeyen eş değerde alternatif tedbirler alır ve sözleşmede yer alan hizmetler ile sunulan hizmetler arasındaki ücret farkını tazmin edemez."]
["7.3. Yukarıda belirtilen tedbirleri almak mümkün değilse ya da bunlar haklı nedenlerle eğitim kurumu tarafından kabul edilmez ise yüklenici, eğitim kurumunun hareket yerine veya kabul edeceği herhangi bir dönüş noktasına geri dönmesi için aynı gün eş değerde ulaşım imkânı sağlar. Tüketicinin yaptığı tüm ödemeleri iki gün içinde iade eder ve gerekli hâllerde tüketicinin zararını tazmin eder."]
["7.4. Yüklenici bu işte her bir araç için 1 sürücü, rehber gerektiren gezilerde 1 rehber bulunduracaktır. Personelde bir değişiklik olması durumunda gezi öncesinde eğitim kurumu yönetimi bilgilendirilerek değişen personele ilişkin belgeler ibraz edilecektir."]
[]
["7.5. Gezi sırasında başka bir araç veya personele ihtiyaç duyulması durumunda gezi kafile başkanı bilgisi dâhilinde yüklenici tarafından gerekli tedbirler ivedilikle alınacaktır. Bu çerçevede kullanılacak araç ve görevlendirilecek personel sözleşmede belirtilen nitelikleri haiz olacaktır."]
["7.6. Yüklenici sözleşme konusu iş ile ilgili çalıştıracağı personele ilişkin sorumlulukları ilgili mevzuatın bu konuyu düzenleyen emredici hükümleri doğrultusunda aynen uygulamakla yükümlüdür."]
["7.7. Yüklenici, taahhüdün sözleşme hükümlerine uygun olarak yerine getirilmemesi ve benzeri nedenlerle ortaya çıkan zarar ve ziyandan doğrudan sorumludur. Bu zarar ve ziyan genel hükümlere göre yükleniciye ikmal ve tazmin ettirilir."]
["7.8. Eğitim kurumu gezilerinde; 1 kafile başkanı ve 40 öğrenciye kadar en fazla 2 öğretmen görevlendirilir. Sorumlu öğretmen sayısı özel eğitime ihtiyacı olan öğrenciler için 10 öğrenciye kadar en az 2, okul öncesi eğitim kurumlarında her grup için en az 1 öğretmen olacak şekilde belirlenir."]
["7.9. Gezi etkinliklerinin hiçbir aşamasında geziye katılması önceden planlanan yönetici, öğretmen, öğrenci ve veliler ile rehber ve sürücü gibi diğer görevliler dışında başka kişiler kesinlikle ulaşım araçlarına alınmayacaktır."]
["Mücbir sebepler"]
["MADDE 8-  Geziye çıkmadan ve gezi sırasında gezinin gerçekleşmesini olumsuz etkileyecek nitelikte meydana gelebilecek herhangi bir siyasi olay, grev, afet, hava şartları ve devletlerarası ilişkilerde yaşanan olumsuzluklar ile aracın arızası veya kazası mücbir sebep olarak kabul edilir ve ilgili hükümlere göre karşılıklı olarak feshedilir. Araca dayalı sebeplerde aynı özelliklerde yeni bir araç sağlanır."]
["Sözleşmenin feshi ve devri"]
["MADDE 9- Yüklenicinin sözleşmeyi feshetmesi hâlinde okul, uğradığı zarar oranında tazminat hakkına sahip olur. Ayrıca yüklenici okulun o güne kadar yaptığı tüm ödemeleri ve okulu borç altına sokan tüm belgeleri on gün içinde okula iade eder."]
["Bildirim"]
["MADDE 10- Eğitim kurumu, sözleşmenin hiç gerçekleşmemesi ya da gereği gibi ifa edilmemesi hâlini, hizmetin ifa edilmesi gerektiği ya da ifa edildiği tarihten itibaren otuz gün içerisinde yükleniciye bildirmek zorundadır."]
["Sözleşmenin ekleri"]
{"$rows_left_out":26}